« | August 2025 | » | 日 | 一 | 二 | 三 | 四 | 五 | 六 | | | | | | 1 | 2 | 3 | 4 | 5 | 6 | 7 | 8 | 9 | 10 | 11 | 12 | 13 | 14 | 15 | 16 | 17 | 18 | 19 | 20 | 21 | 22 | 23 | 24 | 25 | 26 | 27 | 28 | 29 | 30 | 31 | | | | | | | |
| 公告 |
One blog (or more) a day, keep bad mood away, and make life wonderful!
-- by 小生
Blog正在逐步成长中,小生与您共享思维火花,畅想IT时代!
|
Blog信息 |
blog名称:小生杂谈 日志总数:166 评论数量:377 留言数量:1 访问次数:1012972 建立时间:2004年11月7日 |

| |
[网格进程]GT 3.9.4以及今天的工作 原创空间, 软件技术
Wonderow 发表于 2004/12/20 21:26:21 |
GT 3.9.4已于2004.12.17日在Globus的官方网站上正式发布,可能是鉴于偶数版本的软件都应该是稳定版本的规则,这次GT的变化比较大。软件大小从原来的60多M变为90多M,而安装过程也改为较正式的configure和make了。 但编译无法通过,出现这样的错误:gaa_test_utils.c:290: error: conflicting types for 'process_get_authz_id'gaa_test_utils.c:34: error: previous implicit declaration of 'process_get_authz_id' was heremake[2]: *** [gaa_test_utils.o] 错误 1make[2]: Leaving directory `/home/globus/install/gt3.9.4-all-source-installer/source-trees/gsi/gaa_callbacks/gaa_simple/test'make[1]: *** [all-recursive] 错误 1make[1]: Leaving directory `/home/globus/install/gt3.9.4-all-source-installer/source-trees/gsi/gaa_callbacks/gaa_simple/test'ERROR: Build has failedmake: *** [gaa_simple_test] 错误 2 不知道原先为什么会把函数process_get_authz_id()的调用放在声明之前,难道他们用的gcc可以编译通过的?找到该文件,把该process_get_authz_id()函数体移到调用之前,再编译,通过了! 今天GridFTP客户端软件有了进一步的改进,已经加上文件夹/文件图标,浏览右键菜单及功能已基本完成,添加了对链接的处理,修正了一些BUG。并可以把本地文件系统当成FTP服务器浏览,进行文件传输。
基于GT 3.9.2/GT 3.9.3以及jglobus
1.2/1.3的对GridFTP列目录功能还是不行,GridFTP服务器总是返回451或500的错误,不知道是怎么回事。早上尝试着用软件放在GT
3.0.2的机器上运行,把classpath设为jglobus
1.3的一些jar文件后,结果还出现方法未找到的错误,估计要么是classpath还没设对,要么是jglobus版本太高的问题,有机会再试一下。 |
|
|